*Heading
** Job name: Rot-modell Model name: Model-1
** Generated by: Abaqus/CAE 2016
*Preprint, echo=NO, model=NO, history=NO, contact=NO
**
** PARTS
**
*Part, name=Part-1
*Node
*Element, type=S4
*Nset, nset=_PickedSet14, internal, generate
*Elset, elset=_PickedSet14, internal, generate
*Orientation, name=Ori-1, system=CYLINDRICAL
** Section: Section-1
*Shell Section, elset=_PickedSet14, material=Material-1, orientation=Ori-1
5., 5
*End Part
**
**
** ASSEMBLY
**
*Assembly, name=Assembly
**
*Instance, name=Part-1-1, part=Part-1
*End Instance
**
*Nset, nset=_PickedSet4, internal, instance=Part-1-1
*Elset, elset=_PickedSet4, internal, instance=Part-1-1
*Nset, nset=_PickedSet5, internal, instance=Part-1-1, generate
*Elset, elset=_PickedSet5, internal, instance=Part-1-1, generate
*Nset, nset="_T-Part-1-1-Datum csys-1", internal
_PickedSet4,
*Transform, nset="_T-Part-1-1-Datum csys-1", type=C
*End Assembly
**
** MATERIALS
**
*Material, name=Material-1
*Density
 7.8e-09,
*Elastic
210000., 0.29
** ----------------------------------------------------------------
**
** STEP: Step-1
**
*Step, name=Step-1, nlgeom=YES
*Static
1., 1., 1e-05, 1.
**
** BOUNDARY CONDITIONS
**
** Name: BC-1 Type: Displacement/Rotation
*Boundary
_PickedSet4, 2, 2
_PickedSet4, 4, 4
_PickedSet4, 6, 6
**
** LOADS
**
** Name: Load-1   Type: Rotational body force
*Dload
_PickedSet5, CENTRIF, 0.0144,0.,0.,0.,0.,0.,1.
**
** OUTPUT REQUESTS
**
*Restart, write, frequency=0
**
** FIELD OUTPUT: F-Output-1
**
*Output, field
*Node Output
CF, RF, U
*Element Output, directions=YES
E, LE, S
*Contact Output
CDISP, CSTRESS
**
** HISTORY OUTPUT: H-Output-1
**
*Output, history, variable=PRESELECT
*End Step